{"text_format":"1","workbook":"xlsx","n_sheets":12,"sheets":["Intro","Notes & Assumptions","Version History","Compliance Summary","Inputs ->","WAPC Price & Quantity","WAPC Inputs","FY25 ACC","FY25-27 FACC","FY24 Average Combined Charge","TC-4 Price Relativity Inputs","CVC Inclusion Adjustment"],"not_rendered":{"charts":0,"images":0,"macros":0,"external_links":0,"defined_names":15,"comments":0,"pivot_tables":0},"unopened":[],"bounds":{"document_bytes":16777216,"sheet_cells":100000,"rows_first":2000,"rows_last":500,"rows_between":2000,"halvings":0,"cell_chars":16384,"cell_head_chars":4096},"cells_cut":0,"cells_raw":0,"read":"whole","date_system":"1900"}

{"sheet":"Intro","index":0,"n_rows":0,"n_cols":0,"rows_kept":0,"cut":false,"hidden":false,"merged":[]}

{"sheet":"Notes & Assumptions","index":1,"n_rows":0,"n_cols":0,"rows_kept":0,"cut":false,"hidden":false,"merged":[]}

{"sheet":"Version History","index":2,"n_rows":3,"n_cols":5,"rows_kept":3,"cut":false,"hidden":false,"merged":[]}
[null,"Version History"]
[null,"Version","Description",null,"Date Published"]
[null,1,"SAU Price Control Model FY26−FY28",null,"1 May 2025"]

{"sheet":"Compliance Summary","index":3,"n_rows":215,"n_cols":15,"rows_kept":215,"cut":false,"hidden":false,"merged":[[170,1,171,7],[56,1,56,14],[4,1,4,14],[5,1,5,14],[17,1,17,14],[6,1,8,7],[18,1,18,7],[58,1,59,7],[175,1,184,7],[202,1,210,7],[174,1,174,14],[201,1,201,14],[57,1,57,7],[77,1,83,7],[130,1,131,7],[135,1,139,7],[143,1,146,7],[63,2,63,4],[70,2,70,4],[129,1,129,8],[169,1,169,8],[142,1,142,8],[134,1,134,8],[121,1,121,8]]}
[null,"Cell colour meanings"]
[null,"Input cell"]
[null,"Calculation cell"]
[]
[null,"Compliance Summary"]
[null,"2D.2 Weighted average price control (WAPC)"]
[null,"Note: For the first financial year (i.e., prices stated in the FY26 Tariff List), nbn has confirmed that the prices comply with the WAPC formula in clause 2D.2.2 of the SAU. For the second and third financial years in the Pricing Roadmap, nbn has assessed whether the prices are expected to comply with the WAPC formula based on forecasts of CPI and forecast quantities of WAPC Charge Components and Forecast Average Combined Charges for Bundled TC-4 Offers."]
[]
[]
[]
[null,null,"FY26","FY27","FY28"]
[null,"WAPC allowance",{"$f":"_xlfn.XLOOKUP('Compliance Summary'!C$11,'WAPC Inputs'!$C$9:$E$9,'WAPC Inputs'!$C$17:$E$17)","v":2.4000000000000021E-2},{"$f":"_xlfn.XLOOKUP('Compliance Summary'!D$11,'WAPC Inputs'!$C$9:$E$9,'WAPC Inputs'!$C$17:$E$17)","v":3.6999999999999922E-2},{"$f":"_xlfn.XLOOKUP('Compliance Summary'!E$11,'WAPC Inputs'!$C$9:$E$9,'WAPC Inputs'!$C$17:$E$17)","v":2.8000000000000025E-2}]
[]
[null,"Weighted average price change",{"$f":"SUMPRODUCT('WAPC Price & Quantity'!G$17:G$997, 'WAPC Price & Quantity'!O$17:O$997) / SUMPRODUCT('WAPC Price & Quantity'!F$17:F$997, 'WAPC Price & Quantity'!O$17:O$997) - 1","v":2.3521655623054416E-2},{"$f":"SUMPRODUCT('WAPC Price & Quantity'!H$17:H$997, 'WAPC Price & Quantity'!P$17:P$997) / SUMPRODUCT('WAPC Price & Quantity'!G$17:G$997, 'WAPC Price & Quantity'!P$17:P$997) - 1","v":3.6843182790733842E-2},{"$f":"SUMPRODUCT((ISNUMBER(SEARCH(\"CSAS\", 'WAPC Price & Quantity'!B$17:B$997))=FALSE)*'WAPC Price & Quantity'!I$17:I$997, 'WAPC Price & Quantity'!Q$17:Q$997) / SUMPRODUCT((ISNUMBER(SEARCH(\"CSAS\", 'WAPC Price & Quantity'!B$17:B$997))=FALSE)*'WAPC Price & Quantity'!H$17:H$997, 'WAPC Price & Quantity'!Q$17:Q$997) - 1","v":2.7775429957003883E-2}]
[null,null,{"$f":"IF(C14<=C12,\"Compliant\",\"Not compliant\")","v":"Compliant"},{"$f":"IF(D14<=D12,\"Compliant\",\"Not compliant\")","v":"Compliant"},{"$f":"IF(E14<=E12,\"Compliant\",\"Not compliant\")","v":"Compliant"}]
[]
[]
[null,"2C.2 Restriction on changes to price relativities"]
[null,"Note: The reference to 'Year 2 Indicative Prices in Roadmap t − 1' is to the indicative FY26 prices included in Year 2 of the Pricing Roadmap FY25-FY27."]
[]
{"$rows_left_out":196}
{"sheet":"Inputs ->","index":4,"n_rows":0,"n_cols":0,"rows_kept":0,"cut":false,"hidden":false,"merged":[]}

{"sheet":"WAPC Price & Quantity","index":5,"n_rows":298,"n_cols":19,"rows_kept":298,"cut":false,"hidden":false,"merged":[[13,5,13,8],[13,14,13,16],[13,10,13,12],[9,1,11,3],[8,1,8,3]]}
[null,"Cell colour meanings"]
[null,"Input cell"]
[null,"Calculation cell"]
[]
[]
[]
[]
[]
[null,"Price & Quantity Inputs"]
[null,"Note 1: nbn notes that quantities are annualised, consistent with clause 2D.2.2(g) of the SAU. For example, the quantities for monthly charges are multiplied by 12 for an annualised quantity. Quantities for charges with other billing periods are adjusted as required to an annualised basis.\nNote 2: The qt − 1.25 volumes shown in the t = FY26 column represent volumes supplied from 1 April 2024 and 31 March 2025, annualised in accordance with clause 2D.2.2(g) of the SAU. The qt − 1.25 volumes shown in the t = FY27 and t = FY28 columns represent forecast volumes for the periods 1 April 2025 to 31 March 2026 and 1 April 2026 to 31 March 2027, respectively."]
[]
[]
[]
[null,null,null,null,null,"Prices",null,null,null,null,"% Tariff Change",null,null,null,"Quantities"]
[null,null,null,null,null,"pt − 1","pt","pt + 1","pt + 2",null,null,null,null,null,"qt − 1.25","qt − 1.25","qt − 1.25",null,"Notes"]
[null,"Tariff List Table References","WAPC Charge Component","Access Network","Individual Price Control","FY25","FY26","FY27","FY28",null,"FY26","FY27","FY28",null,"t = FY26","t = FY27","t = FY28","Recurring / Non-Recurring Charge","Note numbering below refers to\n'Notes & Assumptions' tab"]
[null,"1.3 Bundled TC-4 Offers","AVC TC-4 12/1 Mbps (Basic Bundled Offer)","Fibre, FTTB, FTTN, FTTC, HFC",{"$f":"_xlfn._xlws.FILTER('Compliance Summary'!$E$86:$E$119,('Compliance Summary'!$C$86:$C$119='WAPC Price & Quantity'!C17)*('Compliance Summary'!$D$86:$D$119='WAPC Price & Quantity'!D17), \"n/a\")","v":"Other fixed line and fixed wireless TC-4"},{"$f":"INDEX('FY25-27 FACC'!$C$15:$F$15,,MATCH(_xlfn._xlws.FILTER('FY25-27 FACC'!$B$70:$B$79,('FY25-27 FACC'!$D$70:$D$79='WAPC Price & Quantity'!$C17)*('FY25-27 FACC'!$E$70:$E$79='WAPC Price & Quantity'!$D17)),'FY25-27 FACC'!$C$14:$F$14,0))","v":12.01},{"$f":"INDEX('FY25-27 FACC'!$C$38:$F$38,,MATCH(_xlfn._xlws.FILTER('FY25-27 FACC'!$B$70:$B$79,('FY25-27 FACC'!$D$70:$D$79='WAPC Price & Quantity'!$C17)*('FY25-27 FACC'!$E$70:$E$79='WAPC Price & Quantity'!$D17)),'FY25-27 FACC'!$C$36:$F$36,0))","v":12.01},{"$f":"INDEX('FY25-27 FACC'!$C$39:$F$39,,MATCH(_xlfn._xlws.FILTER('FY25-27 FACC'!$B$70:$B$79,('FY25-27 FACC'!$D$70:$D$79='WAPC Price & Quantity'!$C17)*('FY25-27 FACC'!$E$70:$E$79='WAPC Price & Quantity'!$D17)),'FY25-27 FACC'!$C$36:$F$36,0))","v":12},12,null,{"$f":"IF(F17>0,G17/F17-1,0)","v":0},{"$f":"IF(G17>0,H17/G17-1,0)","v":-8.3263946711076287E-4},{"$f":"IF(H17>0,I17/H17-1,0)","v":0},null,3309484.34,2790117.8,2422609.33,"Monthly Recurring Charge"]
[null,"1.3 Bundled TC-4 Offers","AVC TC-4 12/1 Mbps","Fibre, FTTB, FTTN, FTTC, HFC, Wireless",{"$f":"_xlfn._xlws.FILTER('Compliance Summary'!$E$86:$E$119,('Compliance Summary'!$C$86:$C$119='WAPC Price & Quantity'!C18)*('Compliance Summary'!$D$86:$D$119='WAPC Price & Quantity'!D18), \"n/a\")","v":"Other fixed line and fixed wireless TC-4"},{"$f":"INDEX('FY25-27 FACC'!$C$15:$F$15,,MATCH(_xlfn._xlws.FILTER('FY25-27 FACC'!$B$70:$B$79,('FY25-27 FACC'!$D$70:$D$79='WAPC Price & Quantity'!$C18)*('FY25-27 FACC'!$E$70:$E$79='WAPC Price & Quantity'!$D18)),'FY25-27 FACC'!$C$14:$F$14,0))","v":32.57},{"$f":"INDEX('FY25-27 FACC'!$C$38:$F$38,,MATCH(_xlfn._xlws.FILTER('FY25-27 FACC'!$B$70:$B$79,('FY25-27 FACC'!$D$70:$D$79='WAPC Price & Quantity'!$C18)*('FY25-27 FACC'!$E$70:$E$79='WAPC Price & Quantity'!$D18)),'FY25-27 FACC'!$C$36:$F$36,0))","v":33.47},{"$f":"INDEX('FY25-27 FACC'!$C$39:$F$39,,MATCH(_xlfn._xlws.FILTER('FY25-27 FACC'!$B$70:$B$79,('FY25-27 FACC'!$D$70:$D$79='WAPC Price & Quantity'!$C18)*('FY25-27 FACC'!$E$70:$E$79='WAPC Price & Quantity'!$D18)),'FY25-27 FACC'!$C$36:$F$36,0))","v":35.14},36.89,null,2.7632790911882088E-2,4.9895428742157133E-2,4.980079681274896E-2,null,2476659.85,2717483.09,3317939.22,"Monthly Recurring Charge"]
[null,"1.3 Bundled TC-4 Offers","AVC TC-4 25/5 Mbps","Fibre, FTTB, FTTN, FTTC, HFC, Wireless",{"$f":"_xlfn._xlws.FILTER('Compliance Summary'!$E$86:$E$119,('Compliance Summary'!$C$86:$C$119='WAPC Price & Quantity'!C19)*('Compliance Summary'!$D$86:$D$119='WAPC Price & Quantity'!D19), \"n/a\")","v":"Entry level TC-4"},{"$f":"INDEX('FY25-27 FACC'!$C$15:$F$15,,MATCH(_xlfn._xlws.FILTER('FY25-27 FACC'!$B$70:$B$79,('FY25-27 FACC'!$D$70:$D$79='WAPC Price & Quantity'!$C19)*('FY25-27 FACC'!$E$70:$E$79='WAPC Price & Quantity'!$D19)),'FY25-27 FACC'!$C$14:$F$14,0))","v":33.96},{"$f":"INDEX('FY25-27 FACC'!$C$38:$F$38,,MATCH(_xlfn._xlws.FILTER('FY25-27 FACC'!$B$70:$B$79,('FY25-27 FACC'!$D$70:$D$79='WAPC Price & Quantity'!$C19)*('FY25-27 FACC'!$E$70:$E$79='WAPC Price & Quantity'!$D19)),'FY25-27 FACC'!$C$36:$F$36,0))","v":34.64},{"$f":"INDEX('FY25-27 FACC'!$C$39:$F$39,,MATCH(_xlfn._xlws.FILTER('FY25-27 FACC'!$B$70:$B$79,('FY25-27 FACC'!$D$70:$D$79='WAPC Price & Quantity'!$C19)*('FY25-27 FACC'!$E$70:$E$79='WAPC Price & Quantity'!$D19)),'FY25-27 FACC'!$C$36:$F$36,0))","v":35.92},36.92,null,2.0023557126030544E-2,3.6951501154734334E-2,2.7839643652561197E-2,null,16003846.550000001,15598340.34,15103346.16,"Monthly Recurring Charge"]
[null,"1.3 Bundled TC-4 Offers","AVC TC-4 25/5-10 Mbps","FTTB, FTTN",{"$f":"_xlfn._xlws.FILTER('Compliance Summary'!$E$86:$E$119,('Compliance Summary'!$C$86:$C$119='WAPC Price & Quantity'!C20)*('Compliance Summary'!$D$86:$D$119='WAPC Price & Quantity'!D20), \"n/a\")","v":"Other fixed line and fixed wireless TC-4"},{"$f":"INDEX('FY25-27 FACC'!$C$15:$F$15,,MATCH(_xlfn._xlws.FILTER('FY25-27 FACC'!$B$70:$B$79,('FY25-27 FACC'!$D$70:$D$79='WAPC Price & Quantity'!$C20)*('FY25-27 FACC'!$E$70:$E$79='WAPC Price & Quantity'!$D20)),'FY25-27 FACC'!$C$14:$F$14,0))","v":33.96},{"$f":"INDEX('FY25-27 FACC'!$C$38:$F$38,,MATCH(_xlfn._xlws.FILTER('FY25-27 FACC'!$B$70:$B$79,('FY25-27 FACC'!$D$70:$D$79='WAPC Price & Quantity'!$C20)*('FY25-27 FACC'!$E$70:$E$79='WAPC Price & Quantity'!$D20)),'FY25-27 FACC'!$C$36:$F$36,0))","v":34.64},{"$f":"INDEX('FY25-27 FACC'!$C$39:$F$39,,MATCH(_xlfn._xlws.FILTER('FY25-27 FACC'!$B$70:$B$79,('FY25-27 FACC'!$D$70:$D$79='WAPC Price & Quantity'!$C20)*('FY25-27 FACC'!$E$70:$E$79='WAPC Price & Quantity'!$D20)),'FY25-27 FACC'!$C$36:$F$36,0))","v":35.92},36.92,null,2.0023557126030544E-2,3.6951501154734334E-2,2.7839643652561197E-2,null,2042979.65,2085204.62,1812863.44,"Monthly Recurring Charge"]
{"$rows_left_out":279}
{"sheet":"WAPC Inputs","index":6,"n_rows":43,"n_cols":5,"rows_kept":43,"cut":false,"hidden":false,"merged":[[4,1,4,4]]}
[null,"Cell colour meanings"]
[null,"Input cell"]
[null,"Calculation cell"]
[]
[null,"WAPC Inputs"]
[]
[null,"Financial Year (t)","FY26"]
[]
[null,"WAPC allowance",{"$f":"C7","v":"FY26"},{"$f":"\"FY\"&RIGHT($C9,2)+1","v":"FY27"},{"$f":"\"FY\"&RIGHT($C9,2)+2","v":"FY28"}]
[null,null,"Actual","Forecast","Forecast"]
[null,"Actual CPI based on December Quarter CPI published in Financial Year t − 1 published by the Australian Bureau of Statistics on 29 January 2025 for the 12 months to 31 December 2024, sourced from: https://www.abs.gov.au/statistics/economy/price-indexes-and-inflation/consumer-price-index-australia/dec-quarter-2024\n\nForecast CPI based on Statement on Monetary Policy published by the Reserve Bank of Australia on 18 February 2025, sourced from:\nhttps://www.rba.gov.au/publications/smp/2025/feb/pdf/statement-on-monetary-policy-2025-02.pdf",2.4E-2,3.6999999999999998E-2,2.8000000000000001E-2]
[]
[null,"X-factor",0,0,0]
[null,"Cost pass-through adjustment factor",{"$f":"'WAPC Inputs'!C31","v":0},{"$f":"'WAPC Inputs'!D31","v":0},{"$f":"'WAPC Inputs'!E31","v":0}]
[null,"Excess adjustment factor",{"$f":"'WAPC Inputs'!C43","v":0},{"$f":"'WAPC Inputs'!D43","v":0},{"$f":"'WAPC Inputs'!E43","v":0}]
[]
[null,"WAPC allowance",{"$f":"(1+C11)*(1-C13)*(1+C14)*(1+C15)-1","v":2.4000000000000021E-2},{"$f":"(1+D11)*(1-D13)*(1+D14)*(1+D15)-1","v":3.6999999999999922E-2},{"$f":"(1+E11)*(1-E13)*(1+E14)*(1+E15)-1","v":2.8000000000000025E-2}]
[]
[null,"Cost pass-through adjustment factor",{"$f":"'WAPC Inputs'!C9","v":"FY26"},{"$f":"'WAPC Inputs'!D9","v":"FY27"},{"$f":"'WAPC Inputs'!E9","v":"FY28"}]
[null,"Note: Values for FY26, FY27, and FY28 below are 'n/a' as there were no cost pass through events in Financial Year t − 1.",{"$f":"C10","v":"Actual"},{"$f":"D10","v":"Forecast"},{"$f":"E10","v":"Forecast"}]
{"$rows_left_out":24}
{"sheet":"FY25 ACC","index":7,"n_rows":300,"n_cols":14,"rows_kept":300,"cut":false,"hidden":false,"merged":[[4,1,4,13],[5,10,5,13],[24,11,24,13],[24,8,24,10],[24,2,24,4],[24,5,24,7],[5,1,14,5],[16,2,16,5],[23,2,23,13],[21,1,21,13]]}
[null,"Cell colour meanings"]
[null,"Input cell"]
[null,"Calculation cell"]
[]
[null,"Calculation of the Average Combined Charges for the period 1 July 2024 to 31 March 2025"]
[null,"Note 1: The Average Daily AVC Overage Charge is calculated for each Bundled TC-4 Offer Group, where the Bundled TC-4 Offer Groups are (i) 12/1 Mbps (Basic Bundled Offer); (ii) 12/1 Mbps (Non-Basic Bundled Offer), 25/5 Mbps and 25/10 Mbps; and (iii) 50/20 Mbps and Up to 100/Up to 20 Mbps.\nNote 2: The Average Combined Charges for 1 July 2024 - 31 March 2025 are an input to the calculation of the FY25 ACC for the Bundled TC-4 Offers. Refer to the FY25-27 FACC tab.\nNote 3: There are separate offers for each of the 12/1 Mbps (Basic Bundled Offer), 12/1 Mbps (Non-Basic Bundled Offer), 25/5 Mbps, 25/10 Mbps, and 50/20 Mbps speed tiers on each relevant access technology, as well as a separate offer for the Up to 100/Up to 20 Mbps bandwidth profile. The calculations shown in the table below group each of the individual offers across their respective access technologies, since these have the same Bundled Price and Daily Combined Charge, and are within the same Bundled TC-4 Offer Group for which an Average Daily AVC Overage Charge is calculated. For example, the 12/1 Mbps (Basic Bundled Offer) item reflects the 12/1 Mbps (Basic Bundled Offer) on the FTTP, FTTB, FTTN, FTTC, and HFC access technologies."]
[]
[]
[]
[]
[]
[]
[]
[]
[]
[]
[null,null,"Bundled TC-4 Offer"]
[null,null,"12/1 Mbps (Basic Bundled Offer)","12/1 Mbps (Non-Basic Bundled Offer)","25/5 Mbps and 25/10 Mbps","50/20 and Up to 100/Up to 20 Mbps "]
[null,"Average Combined Charge\n(1 July 2024 - 31 March 2025)",{"$f":"ROUND(SUM($E$27:$E$300)/COUNT($B$27:$B$300),2)","v":12.01},{"$f":"ROUND(SUM($H$27:$H$300)/COUNT($B$27:$B$300),2)","v":32.54},{"$f":"ROUND(SUM($K$27:$K$300)/COUNT($B$27:$B$300),2)","v":33.93},{"$f":"ROUND(SUM($N$27:$N$300)/COUNT($B$27:$B$300),2)","v":53.59}]
[]
{"$rows_left_out":281}
{"sheet":"FY25-27 FACC","index":8,"n_rows":79,"n_cols":16,"rows_kept":79,"cut":false,"hidden":false,"merged":[[4,1,4,15],[6,1,11,5],[18,1,33,5],[41,11,54,11],[17,1,17,5],[43,1,45,1],[46,1,48,1],[49,1,51,1],[52,1,54,1],[41,6,54,6],[41,12,41,15],[5,1,5,5],[41,2,41,5],[41,7,41,10],[65,1,65,5],[66,1,66,5],[62,12,62,15],[61,2,61,5],[61,7,61,10],[61,12,61,15],[56,12,59,12],[56,13,59,13],[56,15,59,15],[62,2,62,5],[62,7,62,10],[56,2,59,2],[56,3,59,3],[56,5,59,5],[56,7,59,7],[56,8,59,8],[56,10,59,10]]}
[null,"Cell colour meanings"]
[null,"Input cell"]
[null,"Calculation cell"]
[]
[null,"Calculation of the Forecast Average Combined Charge (FACC)"]
[null,"FY25 ACC using Average Combined Charge (from 1 July 2024 to 31 March 2025) and FACC (for 1 April 2025 to 30 June 2025)"]
[null,"Note 1: As per clause 2D.2.2(e)(i) of the SAU, the FY25 ACC (from 1 July 2024 to 30 June 2025), as reflected in the WAPC Price & Quantity tab, is calculated using (i) the Average Combined Charge for the period 1 July 2024 to 31 March 2025; and (ii) the FACC for the period 1 April 2025 to 30 June 2025. For each Bundled TC-4 Offer, the FY25 ACC is the sum of:\n(a) the Average Combined Charge (refer to the FY25 ACC tab) multiplied by 274/365 (representing the number of days between 1 July 2024 and 31 March 2025, as a proportion of the total number of days between 1 July 2024 and 30 June 2025); and\n(b) the FY25 FACC multiplied by 91/365 (representing the number of days between 1 April 2025 and 30 June 2025, as a proportion of the total number of days between 1 July 2024 and 30 June 2025)."]
[]
[]
[]
[]
[]
[]
[null,null,"12/1 Mbps (Basic Bundled Offer)","12/1 Mbps (Non-Basic Bundled Offer)","25/5 Mbps and 25/10 Mbps","50/20 and Up to 100/Up to 20 Mbps "]
[null,"FY25 ACC\n1 July 2024 - 30 June 2025 ",{"$f":"ROUND(INDEX('FY25 ACC'!$C$19:$F$19,,MATCH(C14,'FY25 ACC'!$C$18:$F$18,0))*(274/365)+INDEX($C$37:$F$37,,MATCH(C14,$C$36:$F$36,0))*(91/365),2)","v":12.01},{"$f":"ROUND(INDEX('FY25 ACC'!$C$19:$F$19,,MATCH(D14,'FY25 ACC'!$C$18:$F$18,0))*(274/365)+INDEX($C$37:$F$37,,MATCH(D14,$C$36:$F$36,0))*(91/365),2)","v":32.57},{"$f":"ROUND(INDEX('FY25 ACC'!$C$19:$F$19,,MATCH(E14,'FY25 ACC'!$C$18:$F$18,0))*(274/365)+INDEX($C$37:$F$37,,MATCH(E14,$C$36:$F$36,0))*(91/365),2)","v":33.96},{"$f":"ROUND(INDEX('FY25 ACC'!$C$19:$F$19,,MATCH(F14,'FY25 ACC'!$C$18:$F$18,0))*(274/365)+INDEX($C$37:$F$37,,MATCH(F14,$C$36:$F$36,0))*(91/365),2)","v":53.59}]
[]
[]
[null,"FY25 to FY27 FACC"]
[null,"Note 2: The forecast average of the Average Daily AVC Overage Charge is provided for each Bundled TC-4 Offer Group, where the Bundled TC-4 Offer Groups are (i) 12/1 Mbps (Basic Bundled Offer); (ii) 12/1 Mbps (Non-Basic Bundled Offer), 25/5 Mbps and 25/10 Mbps; and (iii) 50/20 Mbps and Up to 100/Up to 20 Mbps.\nNote 3: If daily usage on the 12/1 Mbps (Basic Bundled Offer) exceeds 0.1 Mbps, the charge will revert to the rate for the 12/1 Mbps (Non-Basic Bundled Offer).\nNote 4: From FY27, the CVC TC-4 (non-Satellite) price will be $0. Accordingly, the Bundled TC-4 Offers in FY26 will transition to Flat-Rate Offers in FY27, as per clause 2B.3.1(d) of the SAU. The FACC for each such offer in FY27 is forecast to be the Monthly Recurring Fixed Charge for that offer in FY27.\nNote 5: There are separate offers for each of the 12/1 Mbps (Basic Bundled Offer), 12/1 Mbps (Non-Basic Bundled Offer), 25/5 Mbps, 25/10 Mbps, and 50/20 Mbps speed tiers on each relevant access technology, as well as a separate offer for the Up to 100/Up to 20 Mbps bandwidth profile. For each such offer, nbn has forecast the proportion of AVCs that fall within the three categories specified in clause 2F.4.2(a)(ii)(A)-(C) of the SAU. These categories are referred to as “Floor”, “In between” and “Ceiling”, and collectively referred to as \"Overage Groups\".\nIn developing such forecast proportions for each relevant offer, nbn has used forecasts of the Average Daily AVC Overage Charge calculated across all offers sharing the same forecast fixed bundled price and CVC inclusion. Accordingly, the proportions of AVCs subject to each Bundled TC-4 Offer that fall within each of the categories in clause 2F.4.2(a)(ii)(A)-(C) of the SAU are the same across Bundled TC-4 Offers that share the same forecast fixed bundled price and CVC inclusion.\nNote 6: In accordance with clause 2F.4.2(a)(ii) of the SAU, nbn forecasts the proportion of AVC TC-4s for each Bundled TC-4 Offer that will fall into the three Overage Groups for each day within the specified period for which the FACC is calculated. This forecast proportion is based on forecast monthly utilisation (such that the proportion for each day is the same across each month).\nFor informational purposes, the table below shows the forecast average proportion of AVC TC-4s for each Bundled TC-4 Offer that will fall into each Overage Group, averaged over the specified periods (i.e., 1 April 2025 to 30 June 2025, FY26, and FY27)."]
[]
{"$rows_left_out":60}
{"sheet":"FY24 Average Combined Charge","index":9,"n_rows":236,"n_cols":14,"rows_kept":236,"cut":false,"hidden":false,"merged":[[20,2,20,13],[21,2,21,4],[21,5,21,7],[21,8,21,10],[21,11,21,13],[4,1,4,13],[5,1,11,5],[5,10,5,13],[14,2,14,5],[18,1,18,13]]}
[null,"Cell colour meanings"]
[null,"Input cell"]
[null,"Calculation cell"]
[]
[null,"Calculation of the Average Combined Charges for the period 1 December 2023 to 30 June 2024"]
[null,"Note 1: The Average Daily AVC Overage Charge is calculated for each Bundled TC-4 Offer Group, where the Bundled TC-4 Offer Groups are (i) 12/1 Mbps (Basic Bundled Offer); (ii) 12/1 Mbps (Non-Basic Bundled Offer), 25/5 Mbps and 25/10 Mbps; and (iii) 50/20 Mbps and Up to 100/Up to 20 Mbps.\nNote 2: There are separate offers for each of the 12/1 Mbps (Basic Bundled Offer), 12/1 Mbps (Non-Basic Bundled Offer), 25/5 Mbps, 25/10 Mbps, and 50/20 Mbps speed tiers on each relevant access technology, as well as a separate offer for the Up to 100/Up to 20 Mbps bandwidth profile. The calculations shown in the table below group each of the individual offers across their respective access technologies, since these have the same Bundled Price and Daily Combined Charge, and are within the same Bundled TC-4 Offer Group for which an Average Daily AVC Overage Charge is calculated. For example, the 12/1 Mbps (Basic Bundled Offer) item reflects the 12/1 Mbps (Basic Bundled Offer) on the FTTP, FTTB, FTTN, FTTC, and HFC access technologies."]
[]
[]
[]
[]
[]
[]
[]
[]
[null,null,"Bundled TC-4 Offer"]
[null,null,"12/1 Mbps (Basic Bundled Offer)","12/1 Mbps (Non-Basic Bundled Offer)","25/5 Mbps and 25/10 Mbps","50/20 and Up to 100/Up to 20 Mbps "]
[null,"Average Combined Charge\n(1 December 2023 - 30 June 2024)",{"$f":"ROUND(SUM($E$24:$E$236)/COUNT($B$24:$B$236),2)","v":12.01},{"$f":"ROUND(SUM($H$24:$H$236)/COUNT($B$24:$B$236),2)","v":30.9},{"$f":"ROUND(SUM($K$24:$K$236)/COUNT($B$24:$B$236),2)","v":32.5},{"$f":"ROUND(SUM($N$24:$N$236)/COUNT($B$24:$B$236),2)","v":51.16}]
[]
[null,"Calculation of the Daily Combined Charge (1 December 2023 - 30 June 2024)"]
[]
{"$rows_left_out":217}
{"sheet":"TC-4 Price Relativity Inputs","index":10,"n_rows":37,"n_cols":6,"rows_kept":37,"cut":false,"hidden":false,"merged":[[4,1,4,5],[5,1,5,5]]}
[null,"Cell colour meanings"]
[null,"Input cell"]
[null,"Calculation cell"]
[]
[null,"TC-4 Prices in FY25-27 Pricing Roadmap"]
[null,"Note: The 'FY26' prices in column F below, are the 'Year 2' indicative prices in the FY25-27 Pricing Roadmap published by nbn on 1 May 2024."]
[]
[null,"t−1 Tariff List Table References","WAPC Charge Component","Access Network","Individual Price Control","Year 2 Indicative Prices\nin Roadmap t − 1"]
[null,"1.1 Flat-Rate Offers","AVC TC-4 25-100/5-20 Mbps","FTTB, FTTN","Other fixed line and fixed wireless TC-4",58.93]
[null,"1.1 Flat-Rate Offers","AVC TC-4 50-100/20 Mbps","FTTC","Other fixed line and fixed wireless TC-4",58.93]
[null,"1.1 Flat-Rate Offers","AVC TC-4 100/20 Mbps","Fibre, HFC","Other fixed line and fixed wireless TC-4",58.93]
[null,"1.1 Flat-Rate Offers","AVC TC-4 200-250/8-20 Mbps","Wireless","Other fixed line and fixed wireless TC-4",58.93]
[null,"1.1 Flat-Rate Offers","AVC TC-4 25-100/5-40 Mbps","FTTB, FTTN","Other fixed line and fixed wireless TC-4",61.930000000000007]
[null,"1.1 Flat-Rate Offers","AVC TC-4 50-100/20-40 Mbps","FTTC","Other fixed line and fixed wireless TC-4",61.930000000000007]
[null,"1.1 Flat-Rate Offers","AVC TC-4 100/40 Mbps","Fibre, HFC","Other fixed line and fixed wireless TC-4",61.930000000000007]
[null,"1.1 Flat-Rate Offers","AVC TC-4 250/25 Mbps","Fibre, HFC","Other fixed line and fixed wireless TC-4",63.930000000000007]
[null,"1.1 Flat-Rate Offers","AVC TC-4 400/10-40 Mbps","Wireless","Other fixed line and fixed wireless TC-4",63.930000000000007]
[null,"1.1 Flat-Rate Offers","AVC TC-4 250/100 Mbps","Fibre","Other fixed line and fixed wireless TC-4",76.5]
[null,"1.1 Flat-Rate Offers","AVC TC-4 500/200 Mbps","Fibre","Other fixed line and fixed wireless TC-4",102]
[null,"1.1 Flat-Rate Offers","AVC TC-4 1000/50 Mbps","Fibre, HFC","Other fixed line and fixed wireless TC-4",73.930000000000007]
{"$rows_left_out":18}
{"sheet":"CVC Inclusion Adjustment","index":11,"n_rows":31,"n_cols":4,"rows_kept":31,"cut":false,"hidden":false,"merged":[[11,1,11,3],[19,1,19,3],[9,2,9,3],[4,1,4,3],[5,1,7,3]]}
[null,"Cell colour meanings"]
[null,"Input cell"]
[null,"Calculation cell"]
[]
[null,"CVC TC-4 Inclusions Adjustment for 1 July 2025"]
[null,"Note 1: The CVC Inclusions for the Previous Adjustment Date (PAD) are reflected in Table 1.3 (Bundled TC-4 Offers) of the FY25 Tariff List.\nNote 2: No CVC inclusion adjustment applies to any Bundled TC-4 Offer with a bandwidth profile of 12/1 Mbps in accordance with 2B.5.1(d)(1)(i) of the SAU."]
[]
[]
[]
[null,null,"Mean Busy Hour Throughput (MBHT)"]
[null,null,"Bundled TC-4 Offer Group \n(12 Mbps & 25 Mbps)","Bundled TC-4 Offer Group\n(50 Mbps & Up to 100/Up to 20 Mbps)"]
[null,"Previous Measurement Period (PMP)"]
[null,"2023-10-01",1.51,2.65]
[null,"2023-11-01",1.53,2.69]
[null,"2023-12-01",1.48,2.65]
[null,"2024-01-01",1.55,2.74]
[null,"2024-02-01",1.5,2.69]
[null,"2024-03-01",1.55,2.78]
[null,"PMP (6 months)",1.52,2.7]
[null,"Measurement Period (MP)"]
{"$rows_left_out":11}