{"text_format":"1","workbook":"xlsx","n_sheets":9,"sheets":["Intro","Notes & Assumptions","Version History","Annual Compliance ->","Price Control Inputs","Price and Quantity","Compliance Summary","Prior year inputs ->","Prior Year Inputs FY24"],"not_rendered":{"charts":0,"images":0,"macros":0,"external_links":0,"defined_names":3,"comments":0,"pivot_tables":0},"unopened":[],"bounds":{"document_bytes":16777216,"sheet_cells":100000,"rows_first":2000,"rows_last":500,"rows_between":2000,"halvings":0,"cell_chars":16384,"cell_head_chars":4096},"cells_cut":0,"cells_raw":0,"read":"whole","date_system":"1900"}

{"sheet":"Intro","index":0,"n_rows":0,"n_cols":0,"rows_kept":0,"cut":false,"hidden":false,"merged":[]}

{"sheet":"Notes & Assumptions","index":1,"n_rows":0,"n_cols":0,"rows_kept":0,"cut":false,"hidden":false,"merged":[]}

{"sheet":"Version History","index":2,"n_rows":6,"n_cols":5,"rows_kept":6,"cut":false,"hidden":false,"merged":[]}
[]
[null,"Version History"]
[]
[null,"Version","Description",null,"Published Date"]
[null,1,"SAU Price Control Model FY25-FY27",null,"1 May 2024"]
[null,1.1000000000000001,"Update to reflect expiry of Continued Ordering Period for Battery Backup Service and UNI-V Product Features for nbn® Ethernet (Fibre) as per Notes & Assumptions tab Note 15.",null,"24 July 2024"]

{"sheet":"Annual Compliance ->","index":3,"n_rows":0,"n_cols":0,"rows_kept":0,"cut":false,"hidden":false,"merged":[]}

{"sheet":"Price Control Inputs","index":4,"n_rows":87,"n_cols":6,"rows_kept":87,"cut":false,"hidden":false,"merged":[]}
["Cell colour meanings"]
[null,"Input cell"]
[null,"Calculation cell"]
[]
[null,"WAPC Allowance Calculations"]
[]
[null,"First financial year in which WAPC applies","FY25"]
[null,"Phase of the WAPC","CPI constraint"]
[]
[null,"WAPC Allowance",{"$f":"\"FY\"&RIGHT($D10,2)-1","v":"FY24"},{"$f":"C7","v":"FY25"},{"$f":"\"FY\"&RIGHT($D10,2)+1","v":"FY26"},{"$f":"\"FY\"&RIGHT($D10,2)+2","v":"FY27"}]
[]
[]
[null,"Annual CPI based on December quarter of Pt-1\nActual CPI for FY24 is based on actual December Quarter CPI as published by the Australian Bureau of Statistics for the 12 months up to 31 December 2023. Forecast CPI for FY25 and FY26 is based on the Reserve Bank of Australia’s forecasts contained in the Statement of Monetary Policy. These are sourced from: Table 3.1: Detailed Forecast Table – February 2024 (https://www.rba.gov.au/publications/smp/2024/feb/outlook.html)",null,4.1000000000000002E-2,3.2000000000000001E-2,2.8000000000000001E-2]
[null,null,null,"Actual","Forecast","Forecast"]
[]
[null,"X factor",null,{"$f":"IF($C$8=\"CPI Constraint\",0,\"Input\")","v":0},{"$f":"IF($C$8=\"CPI Constraint\",0,\"Input\")","v":0},0]
[null,"Cost pass through adjustment factor",null,{"$f":"'Price Control Inputs'!D34","v":0},{"$f":"'Price Control Inputs'!E34","v":0},{"$f":"'Price Control Inputs'!F34","v":0}]
[null,"Excess adjustment factor (EM)",null,{"$f":"'Price Control Inputs'!D47","v":0},{"$f":"'Price Control Inputs'!E47","v":0},{"$f":"'Price Control Inputs'!F47","v":0}]
[]
[null,"WAPC Allowance",null,{"$f":"(1+D13)*(1-D16)*(1+D17)*(1+D18)-1","v":4.0999999999999925E-2},{"$f":"(1+E13)*(1-E16)*(1+E17)*(1+E18)-1","v":3.2000000000000028E-2},{"$f":"(1+F13)*(1-F16)*(1+F17)*(1+F18)-1","v":2.8000000000000025E-2}]
[]
[null,"Cost pass-through factor",{"$f":"'Price Control Inputs'!C10","v":"FY24"},{"$f":"'Price Control Inputs'!D10","v":"FY25"},{"$f":"'Price Control Inputs'!E10","v":"FY26"},{"$f":"'Price Control Inputs'!F10","v":"FY27"}]
[null,"Note: Values for FY25, FY26 and FY27 below are stated as ‘n/a’ as there were no cost pass through events in financial year t-1. The cost pass-through adjustment factor in FY24 is zero: see clause 2D.2.5(c)(i) of the SAU."]
[null,"Inputs",null,"Actual","Forecast","Forecast"]
[null,"Input to cost pass-through adjustment factor in respect of previous year",null,0,{"$f":"D32","v":0},{"$f":"E32","v":0}]
[]
[null,"Total cost pass-through amount for current year",null,"n/a","n/a","n/a"]
[null,"CPI",null,{"$f":"INDEX('Price Control Inputs'!$D$13:$F$13,,MATCH('Price Control Inputs'!D22,'Price Control Inputs'!$D$10:$F$10,0))","v":4.1000000000000002E-2},{"$f":"INDEX('Price Control Inputs'!$D$13:$F$13,,MATCH('Price Control Inputs'!E22,'Price Control Inputs'!$D$10:$F$10,0))","v":3.2000000000000001E-2},{"$f":"INDEX('Price Control Inputs'!$D$13:$F$13,,MATCH('Price Control Inputs'!F22,'Price Control Inputs'!$D$10:$F$10,0))","v":2.8000000000000001E-2}]
[null,"X factor",null,{"$f":"INDEX('Price Control Inputs'!$D$16:$F$16,,MATCH('Price Control Inputs'!D22,'Price Control Inputs'!$D$10:$F$10,0))","v":0},{"$f":"INDEX('Price Control Inputs'!$D$16:$F$16,,MATCH('Price Control Inputs'!E22,'Price Control Inputs'!$D$10:$F$10,0))","v":0},{"$f":"INDEX('Price Control Inputs'!$D$16:$F$16,,MATCH('Price Control Inputs'!F22,'Price Control Inputs'!$D$10:$F$10,0))","v":0}]
[null,"Excess adjustment factor",null,{"$f":"D47","v":0},{"$f":"E47","v":0},{"$f":"F47","v":0}]
{"$rows_left_out":58}
{"sheet":"Price and Quantity","index":5,"n_rows":579,"n_cols":13,"rows_kept":579,"cut":false,"hidden":false,"merged":[[8,10,8,12],[295,1,295,7]]}
["Cell colour meanings"]
[null,"Input cell"]
[null,"Calculation cell"]
[]
[null,"Price Control Price and Volume Inputs FY25 to FY27"]
[]
[]
[]
[null,"Tariff List and Pricing Roadmap Prices",null,null,null,{"$f":"\"FY\"&RIGHT($G$9,2)-1","v":"FY24"},{"$f":"'Price Control Inputs'!C7","v":"FY25"},{"$f":"\"FY\"&RIGHT($G$9,2)+1","v":"FY26"},{"$f":"\"FY\"&RIGHT($G$9,2)+2","v":"FY27"},null,"Percentage Tariff Change"]
[null,"Table references","WAPC Charge Component","NBN Co Network","Individual Price Control",null,null,null,null,null,{"$f":"G9","v":"FY25"},{"$f":"H9","v":"FY26"},{"$f":"I9","v":"FY27"}]
[null,"1.1\t  Flat-Rate Offers","AVC TC-4 25-100/5-20 Mbps","FTTB and FTTN",{"$f":"IFERROR(INDEX('Compliance Summary'!$B$40:$C$79,MATCH($C11,'Compliance Summary'!$C$40:$C$79,0),1),\"n/a\")","v":"Other fixed line and fixed wireless TC-4"},55,57.22,58.930000000000007,60.5,null,{"$f":"IF($E11=\"n/a\",\"n/a\",IFERROR(G11/F11-1,0))","v":4.0363636363636379E-2},{"$f":"IF($E11=\"n/a\",\"n/a\",IFERROR(H11/G11-1,0))","v":2.9884655714785158E-2},{"$f":"IF($E11=\"n/a\",\"n/a\",IFERROR(I11/H11-1,0))","v":2.6641778381130132E-2}]
[null,"1.1\t  Flat-Rate Offers","AVC TC-4 50-100/20 Mbps","FTTC",{"$f":"IFERROR(INDEX('Compliance Summary'!$B$40:$C$79,MATCH($C12,'Compliance Summary'!$C$40:$C$79,0),1),\"n/a\")","v":"Other fixed line and fixed wireless TC-4"},55,57.22,58.930000000000007,60.5,null,{"$f":"IF($E12=\"n/a\",\"n/a\",IFERROR(G12/F12-1,0))","v":4.0363636363636379E-2},2.9884655714785158E-2,2.6641778381130132E-2]
[null,"1.1\t  Flat-Rate Offers","AVC TC-4 100/20 Mbps","Fibre and HFC",{"$f":"IFERROR(INDEX('Compliance Summary'!$B$40:$C$79,MATCH($C13,'Compliance Summary'!$C$40:$C$79,0),1),\"n/a\")","v":"Other fixed line and fixed wireless TC-4"},55,57.22,58.930000000000007,60.5,null,4.0363636363636379E-2,2.9884655714785158E-2,2.6641778381130132E-2]
[null,"1.1\t  Flat-Rate Offers","AVC TC-4 200-250/8-20 Mbps","Wireless",{"$f":"IFERROR(INDEX('Compliance Summary'!$B$40:$C$79,MATCH($C14,'Compliance Summary'!$C$40:$C$79,0),1),\"n/a\")","v":"Other fixed line and fixed wireless TC-4"},55,57.22,58.930000000000007,60.5,null,4.0363636363636379E-2,2.9884655714785158E-2,2.6641778381130132E-2]
[null,"1.1\t  Flat-Rate Offers","AVC TC-4 50-100/20-40 Mbps","FTTC",{"$f":"IFERROR(INDEX('Compliance Summary'!$B$40:$C$79,MATCH($C15,'Compliance Summary'!$C$40:$C$79,0),1),\"n/a\")","v":"Other fixed line and fixed wireless TC-4"},58,60.22,61.930000000000007,63.5,null,3.8275862068965605E-2,2.8395881766855036E-2,2.5351202971096276E-2]
[null,"1.1\t  Flat-Rate Offers","AVC TC-4 25-100/5-40 Mbps","FTTB and FTTN",{"$f":"IFERROR(INDEX('Compliance Summary'!$B$40:$C$79,MATCH($C16,'Compliance Summary'!$C$40:$C$79,0),1),\"n/a\")","v":"Other fixed line and fixed wireless TC-4"},58,60.22,61.930000000000007,63.5,null,3.8275862068965605E-2,2.8395881766855036E-2,2.5351202971096276E-2]
[null,"1.1\t  Flat-Rate Offers","AVC TC-4 100/40 Mbps","Fibre and HFC",{"$f":"IFERROR(INDEX('Compliance Summary'!$B$40:$C$79,MATCH($C17,'Compliance Summary'!$C$40:$C$79,0),1),\"n/a\")","v":"Other fixed line and fixed wireless TC-4"},58,60.22,61.930000000000007,63.5,null,3.8275862068965605E-2,2.8395881766855036E-2,2.5351202971096276E-2]
[null,"1.1\t  Flat-Rate Offers","AVC TC-4 250/25 Mbps","Fibre and HFC",{"$f":"IFERROR(INDEX('Compliance Summary'!$B$40:$C$79,MATCH($C18,'Compliance Summary'!$C$40:$C$79,0),1),\"n/a\")","v":"Other fixed line and fixed wireless TC-4"},60,62.22,63.930000000000007,65.5,null,3.6999999999999922E-2,2.7483124397299941E-2,2.4558110433286373E-2]
[null,"1.1\t  Flat-Rate Offers","AVC TC-4 400/10-40 Mbps","Wireless",{"$f":"IFERROR(INDEX('Compliance Summary'!$B$40:$C$79,MATCH($C19,'Compliance Summary'!$C$40:$C$79,0),1),\"n/a\")","v":"Other fixed line and fixed wireless TC-4"},60,62.22,63.930000000000007,65.5,null,3.6999999999999922E-2,2.7483124397299941E-2,2.4558110433286373E-2]
[null,"1.1\t  Flat-Rate Offers","AVC TC-4 250/100 Mbps","Fibre",{"$f":"IFERROR(INDEX('Compliance Summary'!$B$40:$C$79,MATCH($C20,'Compliance Summary'!$C$40:$C$79,0),1),\"n/a\")","v":"Other fixed line and fixed wireless TC-4"},100,75,76.5,78.03,null,-0.25,2.0000000000000018E-2,2.0000000000000018E-2]
[null,"1.1\t  Flat-Rate Offers","AVC TC-4 500/200 Mbps","Fibre",{"$f":"IFERROR(INDEX('Compliance Summary'!$B$40:$C$79,MATCH($C21,'Compliance Summary'!$C$40:$C$79,0),1),\"n/a\")","v":"Other fixed line and fixed wireless TC-4"},160,100,102,104.04,null,-0.375,2.0000000000000018E-2,2.0000000000000018E-2]
[null,"1.1\t  Flat-Rate Offers","AVC TC-4 1000/50 Mbps","Fibre and HFC",{"$f":"IFERROR(INDEX('Compliance Summary'!$B$40:$C$79,MATCH($C22,'Compliance Summary'!$C$40:$C$79,0),1),\"n/a\")","v":"Other fixed line and fixed wireless TC-4"},70,72.22,73.930000000000007,75.5,null,3.1714285714285806E-2,2.3677651620049867E-2,2.1236304612471057E-2]
[null,"1.1\t  Flat-Rate Offers","AVC TC-4 1000/400 Mbps ","Fibre",{"$f":"IFERROR(INDEX('Compliance Summary'!$B$40:$C$79,MATCH($C23,'Compliance Summary'!$C$40:$C$79,0),1),\"n/a\")","v":"Other fixed line and fixed wireless TC-4"},230,125,127.5,130.05000000000001,null,-0.45652173913043481,2.0000000000000018E-2,2.0000000000000018E-2]
[null,"1.2\t  Flat-Rate Offers - Smart Places","Smart Places - AVC TC-4 100/40 Mbps","Fibre",{"$f":"IFERROR(INDEX('Compliance Summary'!$B$40:$C$79,MATCH($C24,'Compliance Summary'!$C$40:$C$79,0),1),\"n/a\")","v":"Other fixed line and fixed wireless TC-4"},58,60.22,61.930000000000007,63.5,null,3.8275862068965605E-2,2.8395881766855036E-2,2.5351202971096276E-2]
[null,"1.2\t  Flat-Rate Offers - Smart Places","Smart Places - AVC TC-4 250/100 Mbps","Fibre",{"$f":"IFERROR(INDEX('Compliance Summary'!$B$40:$C$79,MATCH($C25,'Compliance Summary'!$C$40:$C$79,0),1),\"n/a\")","v":"Other fixed line and fixed wireless TC-4"},100,75,76.5,78.03,null,-0.25,2.0000000000000018E-2,2.0000000000000018E-2]
[null,"1.2\t  Flat-Rate Offers - Smart Places","Smart Places - AVC TC-4 500/200 Mbps","Fibre",{"$f":"IFERROR(INDEX('Compliance Summary'!$B$40:$C$79,MATCH($C26,'Compliance Summary'!$C$40:$C$79,0),1),\"n/a\")","v":"Other fixed line and fixed wireless TC-4"},160,100,102,104.04,null,-0.375,2.0000000000000018E-2,2.0000000000000018E-2]
[null,"1.2\t  Flat-Rate Offers - Smart Places","Smart Places - AVC TC-4 1000/400 Mbps ","Fibre",{"$f":"IFERROR(INDEX('Compliance Summary'!$B$40:$C$79,MATCH($C27,'Compliance Summary'!$C$40:$C$79,0),1),\"n/a\")","v":"Other fixed line and fixed wireless TC-4"},230,125,127.5,130.05000000000001,null,-0.45652173913043481,2.0000000000000018E-2,2.0000000000000018E-2]
[null,"1.3\t  Bundled TC-4 Offers ","AVC TC-4 12/1 (Basic Bundled Offer)","Fibre, FTTB, FTTN, FTTC, HFC",{"$f":"IFERROR(INDEX('Compliance Summary'!$B$40:$C$79,MATCH($C28,'Compliance Summary'!$C$40:$C$79,0),1),\"n/a\")","v":"Other fixed line and fixed wireless TC-4"},12.01,12.01,12.01,12,null,0,0,-8.3263946711076287E-4]
[null,"1.3\t  Bundled TC-4 Offers ","AVC TC-4 12/1 Mbps ","Fibre, FTTB, FTTN, FTTC, HFC and Wireless",{"$f":"IFERROR(INDEX('Compliance Summary'!$B$40:$C$79,MATCH($C29,'Compliance Summary'!$C$40:$C$79,0),1),\"n/a\")","v":"Other fixed line and fixed wireless TC-4"},30.76,32.29,33.89,35.58,null,4.9739921976592827E-2,4.9550944564880739E-2,4.9867217468279712E-2]
[null,"1.3\t  Bundled TC-4 Offers ","AVC TC-4 25/5 Mbps ","Fibre, FTTB, FTTN,FTTC,HFC and Wireless",{"$f":"IFERROR(INDEX('Compliance Summary'!$B$40:$C$79,MATCH($C30,'Compliance Summary'!$C$40:$C$79,0),1),\"n/a\")","v":"Entry level TC-4"},32.36,33.68,34.75,35.71,null,4.0791100123609425E-2,3.1769596199525019E-2,2.7625899280575572E-2]
{"$rows_left_out":550}
{"sheet":"Compliance Summary","index":6,"n_rows":130,"n_cols":7,"rows_kept":130,"cut":false,"hidden":false,"merged":[[11,2,11,4],[28,2,28,4],[21,2,21,4],[9,1,9,6],[19,1,19,6]]}
["Cell colour meanings"]
[null,"Input cell"]
[null,"Calculation cell"]
[]
[null,"Compliance Summary"]
[]
[null,"Applicable Financial Year for Proposed Tariff List",{"$f":"'Price Control Inputs'!C7","v":"FY25"}]
[]
[null,"Weighted Average Price Control"]
[null,"Note: For the first financial year (i.e. prices that are stated in the Tariff List), nbn has confirmed that the prices comply with the WAPC formula in clause 2D.2.2 of the SAU. For the second and third \nfinancial years in the Pricing Roadmap, nbn has assessed whether the prices are expected to comply with the WAPC formula based on forecasts of CPI and forecast quantities of WAPC Charge Components and Forecast Average Combined Charges for Bundled TC-4 Offers."]
[]
[]
[null,null,{"$f":"C7","v":"FY25"},{"$f":"\"FY\"&RIGHT($C13,2)+1","v":"FY26"},{"$f":"\"FY\"&RIGHT($C13,2)+2","v":"FY27"}]
[null,"WAPC Allowance",{"$f":"_xlfn.XLOOKUP(C13,'Price Control Inputs'!$D$10:$F$10,'Price Control Inputs'!$D$20:$F$20,,0)","v":4.0999999999999925E-2},{"$f":"_xlfn.XLOOKUP(D13,'Price Control Inputs'!$D$10:$F$10,'Price Control Inputs'!$D$20:$F$20,,0)","v":3.2000000000000028E-2},{"$f":"_xlfn.XLOOKUP(E13,'Price Control Inputs'!$D$10:$F$10,'Price Control Inputs'!$D$20:$F$20,,0)","v":2.8000000000000025E-2}]
[]
[null,"Weighted Average Price Control (WAPC)",{"$f":"(SUMPRODUCT('Price and Quantity'!G$11:G$13,'Price and Quantity'!F$299:F$301) + SUMPRODUCT('Price and Quantity'!G$15:G$18,'Price and Quantity'!F$303:F$306) + SUMPRODUCT('Price and Quantity'!G$20:G$74,'Price and Quantity'!F$308:F$362) + SUMPRODUCT('Price and Quantity'!G$77:G$94,'Price and Quantity'!F$365:F$382) + SUMPRODUCT('Price and Quantity'!G$96:G$291,'Price and Quantity'!F$384:F$579)) /\n(SUMPRODUCT('Price and Quantity'!F$11:F$13,'Price and Quantity'!F$299:F$301) + SUMPRODUCT('Price and Quantity'!F$15:F$18,'Price and Quantity'!F$303:F$306) + SUMPRODUCT('Price and Quantity'!F$20:F$74,'Price and Quantity'!F$308:F$362) + SUMPRODUCT('Price and Quantity'!F$77:F$94,'Price and Quantity'!F$365:F$382) + SUMPRODUCT('Price and Quantity'!F$96:F$291,'Price and Quantity'!F$384:F$579))-1","v":4.0800250986573028E-2},{"$f":"SUMPRODUCT('Price and Quantity'!H$11:H$289,'Price and Quantity'!G$299:G$577)/SUMPRODUCT('Price and Quantity'!G$11:G$289,'Price and Quantity'!G$299:G$577)-1","v":3.1460595579110961E-2},{"$f":"SUMPRODUCT('Price and Quantity'!I$11:I$289,'Price and Quantity'!H$299:H$577)/SUMPRODUCT('Price and Quantity'!H$11:H$289,'Price and Quantity'!H$299:H$577)-1","v":2.7076277903100854E-2}]
[null,null,{"$f":"IF(C16<=C14,\"Compliant\",\"Not Compliant\")","v":"Compliant"},{"$f":"IF(D16<=D14,\"Compliant\",\"Not Compliant\")","v":"Compliant"},"Compliant"]
[]
[null,"Individual Price Controls"]
[null,"Note: For the first financial year (i.e. prices that are stated in the Tariff List), nbn has confirmed that the prices comply with the Individual Price Controls. For the second and third financial years in the Pricing Roadmap, nbn has assessed whether the prices are expected to comply with the Individual Price Controls based on forecasts of CPI and Forecast Average Combined Charges for Bundled TC-4 Offers."]
[]
[null,null,"Price Increase Limit"]
[null,"Individual Price Control Category",{"$f":"C13","v":"FY25"},"FY26","FY27"]
[null,"Entry level TC-4",{"$f":"HLOOKUP('Compliance Summary'!C13,'Price Control Inputs'!$C$10:$F$20,4,0)","v":4.1000000000000002E-2},{"$f":"HLOOKUP('Compliance Summary'!D13,'Price Control Inputs'!$C$10:$F$20,4,0)","v":3.2000000000000001E-2},{"$f":"HLOOKUP('Compliance Summary'!E13,'Price Control Inputs'!$C$10:$F$20,4,0)","v":2.8000000000000001E-2}]
[null,"Other fixed line and fixed wireless TC-4",{"$f":"MAX(C24,5%)","v":0.05},{"$f":"MAX(D24,5%)","v":0.05},0.05]
[null,"Satellite AVC TC-4",{"$f":"C24","v":4.1000000000000002E-2},{"$f":"D24","v":3.2000000000000001E-2},2.8000000000000001E-2]
[null,"Satellite CVC TC-4",0,0,0]
[]
[null,null,"Maximum Tariff Change (within each group)"]
[null,"Individual Price Control Category",{"$f":"C13","v":"FY25"},{"$f":"D13","v":"FY26"},{"$f":"E13","v":"FY27"}]
{"$rows_left_out":101}
{"sheet":"Prior year inputs ->","index":7,"n_rows":0,"n_cols":0,"rows_kept":0,"cut":false,"hidden":false,"merged":[]}

{"sheet":"Prior Year Inputs FY24","index":8,"n_rows":31,"n_cols":6,"rows_kept":31,"cut":false,"hidden":false,"merged":[]}
["Cell colour meanings"]
[null,"Input cell"]
[null,"Calculation cell"]
[null,"Inputs used in FY24 WAPC model"]
[]
[null,"Model start financial year (t-1)",2024]
[null,"Forecast December Quarter CPI",4.1000000000000002E-2]
[]
[null,"Prices in nbn's Pricing Roadmap published for FY24 to FY26",null,null,"FY24","FY25"]
[null,"Roadmap table","Tariff List","Side Constraint Identifier"]
[null,"1.1\t  Flat-Rate Offers","AVC TC-4 100/20 Mbps","Other fixed line and fixed wireless TC-4",null,57.22]
[null,"1.1\t  Flat-Rate Offers","AVC TC-4 100/40 Mbps","Other fixed line and fixed wireless TC-4",null,60.22]
[null,"1.1\t  Flat-Rate Offers","AVC TC-4 250/25 Mbps","Other fixed line and fixed wireless TC-4",null,62.22]
[null,"1.1\t  Flat-Rate Offers","AVC TC-4 250/100 Mbps","Other fixed line and fixed wireless TC-4",null,75]
[null,"1.1\t  Flat-Rate Offers","AVC TC-4 500/200 Mbps","Other fixed line and fixed wireless TC-4",null,100]
[null,"1.1\t  Flat-Rate Offers","AVC TC-4 1000/50 Mbps","Other fixed line and fixed wireless TC-4",null,72.22]
[null,"1.1\t  Flat-Rate Offers","AVC TC-4 1000/400 Mbps ","Other fixed line and fixed wireless TC-4",null,125]
[null,"1.2\t  Flat-Rate Offers - Smart Places","Smart Places - AVC TC-4 100/40 Mbps","Other fixed line and fixed wireless TC-4",null,60.22]
[null,"1.2\t  Flat-Rate Offers - Smart Places","Smart Places - AVC TC-4 250/100 Mbps","Other fixed line and fixed wireless TC-4",null,75]
[null,"1.2\t  Flat-Rate Offers - Smart Places","Smart Places - AVC TC-4 500/200 Mbps","Other fixed line and fixed wireless TC-4",null,100]
[null,"1.2\t  Flat-Rate Offers - Smart Places","Smart Places - AVC TC-4 1000/400 Mbps ","Other fixed line and fixed wireless TC-4",null,125]
[null,"1.3\t  Bundled TC-4 Offers ","AVC TC-4 12/1 (Basic Bundled Offer)","Other fixed line and fixed wireless TC-4",null,12]
[null,"1.3\t  Bundled TC-4 Offers ","AVC TC-4 12/1 Mbps ","Other fixed line and fixed wireless TC-4",null,32.020000000000003]
[null,"1.3\t  Bundled TC-4 Offers ","AVC TC-4 25/5 Mbps ","Entry level TC-4",null,33.47]
[null,"1.3\t  Bundled TC-4 Offers ","AVC TC-4 25/10 Mbps ","Other fixed line and fixed wireless TC-4",null,33.47]
[null,"1.3\t  Bundled TC-4 Offers ","AVC TC-4 50/20 Mbps ","Other fixed line and fixed wireless TC-4",null,53.6]
[null,"1.3\t  Bundled TC-4 Offers ","AVC TC-4 up to 75/up to 10 Mbps ","Other fixed line and fixed wireless TC-4",null,53.6]
[null,"1.4\t  Bundled TC-4 Offers: Smart Places","Smart Places - AVC TC-4 25/10 Mbps ","Other fixed line and fixed wireless TC-4",null,33.47]
[null,"1.4\t  Bundled TC-4 Offers: Smart Places","Smart Places - AVC TC-4 50/20 Mbps ","Other fixed line and fixed wireless TC-4",null,53.6]
[null,"1.5  Asymmetric AVC Offers in respect of the NBN Co Satellite Network","AVC TC-4 12/1 Mbps","Satellite AVC TC-4",null,24]
{"$rows_left_out":1}