{"text_format":"1","workbook":"xlsx","n_sheets":13,"sheets":["Intro","Notes & Assumptions","Version History","Compliance Summary","Price Control Inputs ->","WAPC Price & Quantity","WAPC Inputs","FY26 ACC","FY26 FACC","FY25 Average Combined Charges","TC-4 Price Relativity Inputs","FY27 EM Inputs","FY28 EM Inputs"],"not_rendered":{"charts":0,"images":0,"macros":0,"external_links":0,"defined_names":108,"comments":0,"pivot_tables":0},"unopened":[],"bounds":{"document_bytes":16777216,"sheet_cells":100000,"rows_first":2000,"rows_last":500,"rows_between":2000,"halvings":0,"cell_chars":16384,"cell_head_chars":4096},"cells_cut":0,"cells_raw":0,"read":"whole","date_system":"1900"}

{"sheet":"Intro","index":0,"n_rows":0,"n_cols":0,"rows_kept":0,"cut":false,"hidden":false,"merged":[]}

{"sheet":"Notes & Assumptions","index":1,"n_rows":113,"n_cols":5,"rows_kept":113,"cut":false,"hidden":false,"merged":[[111,3,112,3],[111,4,112,4],[89,3,90,3],[89,4,90,4],[91,1,96,1],[91,3,96,3],[91,4,96,4],[97,1,105,1],[97,4,110,4],[103,3,105,3],[106,1,109,1],[106,3,110,3],[111,1,112,1],[89,1,90,1]]}
[]
[]
[]
[]
[]
[]
[]
[]
[]
[]
[]
[]
[]
[]
[]
{"$rows_left_out":99}
{"sheet":"Version History","index":2,"n_rows":3,"n_cols":4,"rows_kept":3,"cut":false,"hidden":false,"merged":[[0,1,0,3]]}
[null,"Version History"]
[null,"Version","Description","Date Published"]
[null,1,"SAU Price Control Model FY27−FY29","1 May 2026"]

{"sheet":"Compliance Summary","index":3,"n_rows":216,"n_cols":15,"rows_kept":216,"cut":false,"hidden":false,"merged":[[177,1,188,7],[207,1,211,7],[176,1,176,14],[206,1,206,14],[62,1,62,7],[132,1,133,7],[137,1,141,7],[145,1,148,7],[68,2,68,4],[76,2,76,4],[131,1,131,8],[171,1,171,8],[144,1,144,8],[136,1,136,8],[125,1,125,8],[172,1,173,7],[63,1,64,7],[61,1,61,14],[4,1,4,14],[5,1,5,14],[17,1,17,14],[6,1,8,7],[18,1,18,7]]}
[null,"Cell colour meanings"]
[null,"Input cell"]
[null,"Calculation cell"]
[]
[null,"Compliance Summary"]
[null,"2D.2 Weighted average price control (WAPC)"]
[null,"Note: For the first financial year (i.e., prices stated in the FY27 Tariff List), nbn has confirmed that the prices comply with the WAPC formula in clause 2D.2.2 of the SAU. For the second and third financial years in the Pricing Roadmap, nbn has assessed whether the prices are expected to comply with the WAPC formula based on forecasts of CPI and forecast quantities of WAPC Charge Components."]
[]
[]
[]
[null,null,"FY27","FY28","FY29"]
[null,"WAPC allowance",{"$f":"_xlfn.XLOOKUP('Compliance Summary'!C$11,'WAPC Inputs'!$C$9:$E$9,'WAPC Inputs'!$C$17:$E$17)","v":3.6033331063118901E-2},{"$f":"_xlfn.XLOOKUP('Compliance Summary'!D$11,'WAPC Inputs'!$C$9:$E$9,'WAPC Inputs'!$C$17:$E$17)","v":3.4730635718586589E-2},{"$f":"_xlfn.XLOOKUP('Compliance Summary'!E$11,'WAPC Inputs'!$C$9:$E$9,'WAPC Inputs'!$C$17:$E$17)","v":2.6813692895947705E-2}]
[]
[null,"Weighted average price change",{"$f":"SUMPRODUCT('WAPC Price & Quantity'!G$19:G$1000,'WAPC Price & Quantity'!O$19:O$1000)/SUMPRODUCT('WAPC Price & Quantity'!F$19:F$1000,'WAPC Price & Quantity'!O$19:O$1000)-1","v":3.6032790223489375E-2},{"$f":"SUMPRODUCT('WAPC Price & Quantity'!H$19:H$1000,'WAPC Price & Quantity'!P$19:P$1000)/SUMPRODUCT('WAPC Price & Quantity'!G$19:G$1000,'WAPC Price & Quantity'!P$19:P$1000)-1","v":3.4280607180136036E-2},{"$f":"SUMPRODUCT('WAPC Price & Quantity'!I$19:I$1000,'WAPC Price & Quantity'!Q$19:Q$1000)/SUMPRODUCT('WAPC Price & Quantity'!H$19:H$1000,'WAPC Price & Quantity'!Q$19:Q$1000)-1","v":2.674461424541863E-2}]
[null,null,{"$f":"IF(C14<=C12,\"Compliant\",\"Not compliant\")","v":"Compliant"},{"$f":"IF(D14<=D12,\"Compliant\",\"Not compliant\")","v":"Compliant"},"Compliant"]
{"$rows_left_out":202}
{"sheet":"Price Control Inputs ->","index":4,"n_rows":0,"n_cols":0,"rows_kept":0,"cut":false,"hidden":false,"merged":[]}

{"sheet":"WAPC Price & Quantity","index":5,"n_rows":322,"n_cols":19,"rows_kept":322,"cut":false,"hidden":false,"merged":[[1,2,6,3],[15,5,15,8],[15,14,15,16],[15,10,15,12],[9,1,13,3],[8,1,8,3]]}
[null,"Cell colour meanings"]
[null,"Input cell","nbn is a wholesaler and does not control retail prices charged by service providers. The wholesale prices in this document are exclusive of GST. References to speeds or bandwidth profiles in this document are not to end customer speeds; they are wholesale layer 2 peak or committed information rates (PIR or CIR) or potential maximum information rate bandwidth provided to retail providers unless stated otherwise. An end customer’s experience, including the speeds actually achieved over the nbn network, depends on the network technology and configuration over which services are delivered to their premises, whether they are using the internet during the busy period, and some factors outside of nbn’s control (like their equipment quality, software, chosen broadband plan, signal reception, or how their provider designs its network). Refer to nbn’s website and the Wholesale Broadband Agreement for further information."]
[null,"Calculation cell"]
[]
[]
[]
[]
[]
[null,"Price & Quantity Inputs"]
[null,"Note 1: nbn notes that quantities are annualised, consistent with clause 2D.2.2(g) of the SAU. For example, the quantities for monthly charges are multiplied by 12 for an annualised quantity. Quantities for charges with other billing periods are adjusted as required to an annualised basis.\nNote 2: The qt − 1.25 volumes shown in the t = FY27 column represent volumes supplied from 1 April 2025 and 31 March 2026, annualised in accordance with clause 2D.2.2(g) of the SAU. The qt − 1.25 volumes shown in the t = FY28 and t = FY29 columns represent forecast volumes for the periods 1 April 2026 to 31 March 2027 and 1 April 2027 to 31 March 2028, respectively."]
[]
[]
[]
[]
[]
{"$rows_left_out":308}
{"sheet":"WAPC Inputs","index":6,"n_rows":43,"n_cols":5,"rows_kept":43,"cut":false,"hidden":false,"merged":[[4,1,4,4]]}
[null,"Cell colour meanings"]
[null,"Input cell"]
[null,"Calculation cell"]
[]
[null,"WAPC Inputs"]
[]
[null,"Financial Year (t)","FY27"]
[]
[null,"WAPC allowance",{"$f":"C7","v":"FY27"},{"$f":"\"FY\"&RIGHT($C9,2)+1","v":"FY28"},{"$f":"\"FY\"&RIGHT($C9,2)+2","v":"FY29"}]
[null,null,"Actual","Forecast","Forecast"]
[null,"Actual CPI based on December Quarter CPI published in Financial Year t − 1 published by the Australian Bureau of Statistics on 28 January 2026 for the 12 months to 31 December 2025, sourced from: https://www.abs.gov.au/statistics/economy/price-indexes-and-inflation/consumer-price-index-australia/latest-release\n\nForecast CPI based on Statement on Monetary Policy published by the Reserve Bank of Australia on 3 February 2026, sourced from: https://www.rba.gov.au/publications/smp/2026/feb/pdf/statement-on-monetary-policy-2026-02.pdf",{"$f":"100.32/96.81-1","v":3.6256585063526359E-2},3.5999999999999997E-2,2.7E-2]
[]
[null,"X-factor",0,0,0]
[null,"Cost pass-through adjustment factor",{"$f":"'WAPC Inputs'!C31","v":0},{"$f":"'WAPC Inputs'!D31","v":0},{"$f":"'WAPC Inputs'!E31","v":0}]
[null,"Excess adjustment factor",{"$f":"'WAPC Inputs'!C43","v":-2.1544278089569158E-4},{"$f":"'WAPC Inputs'!D43","v":-1.2252550978895105E-3},{"$f":"'WAPC Inputs'!E43","v":-1.8140905944719066E-4}]
{"$rows_left_out":29}
{"sheet":"FY26 ACC","index":7,"n_rows":299,"n_cols":14,"rows_kept":299,"cut":false,"hidden":false,"merged":[[4,1,4,13],[5,10,5,13],[23,11,23,13],[23,8,23,10],[23,2,23,4],[23,5,23,7],[5,1,13,5],[15,2,15,5],[22,2,22,13],[20,1,20,13]]}
[null,"Cell colour meanings"]
[null,"Input cell"]
[null,"Calculation cell"]
[]
[null,"Calculation of the Average Combined Charges for the period 1 July 2025 to 31 March 2026"]
[null,"Note 1: The Average Daily AVC Overage Charge is calculated for each Bundled TC-4 Offer Group, where the Bundled TC-4 Offer Groups are (i) 12/1 Mbps (Basic Bundled Offer); (ii) 12/1 Mbps (Non-Basic Bundled Offer), 25/5 Mbps and 25/10 Mbps; and (iii) 50/20 Mbps and Up to 100/Up to 20 Mbps.\nNote 2: The Average Combined Charges for 1 July 2025 - 31 March 2026 are an input to the calculation of the FY26 ACC for the Bundled TC-4 Offers. Refer to the FY26 FACC tab.\nNote 3: There are separate offers for each of the 12/1 Mbps (Basic Bundled Offer), 12/1 Mbps (Non-Basic Bundled Offer), 25/5 Mbps, 25/10 Mbps, and 50/20 Mbps speed tiers on each relevant access technology, as well as a separate offer for the Up to 100/Up to 20 Mbps bandwidth profile. The calculations shown in the table below group each of the individual offers across their respective access technologies, since these have the same Bundled Price and Daily Combined Charge, and are within the same Bundled TC-4 Offer Group for which an Average Daily AVC Overage Charge is calculated. For example, the 12/1 Mbps (Basic Bundled Offer) item reflects the 12/1 Mbps (Basic Bundled Offer) on the FTTP, FTTB, FTTN, FTTC, and HFC access technologies."]
[]
[]
[]
[]
[]
[]
[]
[]
[]
{"$rows_left_out":285}
{"sheet":"FY26 FACC","index":8,"n_rows":79,"n_cols":6,"rows_kept":79,"cut":false,"hidden":false,"merged":[[54,3,57,3],[54,5,57,5],[63,1,63,5],[64,1,64,5],[59,2,59,5],[60,2,60,5],[54,2,57,2],[4,1,4,5],[6,1,11,5],[18,1,33,5],[17,1,17,5],[41,1,43,1],[44,1,46,1],[47,1,49,1],[50,1,52,1],[5,1,5,5],[39,2,39,5]]}
[null,"Cell colour meanings"]
[null,"Input cell"]
[null,"Calculation cell"]
[]
[null,"Calculation of the Forecast Average Combined Charge (FACC)"]
[null,"FY26 ACC using Average Combined Charge (from 1 July 2025 to 31 March 2026) and FACC (for 1 April 2026 to 30 June 2026)"]
[null,"Note 1: As per clause 2D.2.2(e)(i) of the SAU, the FY26 ACC (from 1 July 2025 to 30 June 2026), as reflected in the WAPC Price & Quantity tab, is calculated using (i) the Average Combined Charge for the period 1 July 2025 to 31 March 2026; and (ii) the FACC for the period 1 April 2026 to 30 June 2026. For each Bundled TC-4 Offer, the FY26 ACC is the sum of:\n(a) the Average Combined Charge (refer to the FY26 ACC tab) multiplied by 274/365 (representing the number of days between 1 July 2025 and 31 March 2026, as a proportion of the total number of days between 1 July 2025 and 30 June 2026); and\n(b) the FY26 FACC multiplied by 91/365 (representing the number of days between 1 April 2026 and 30 June 2026, as a proportion of the total number of days between 1 July 2025 and 30 June 2026)."]
[]
[]
[]
[]
[]
[]
[null,null,"12/1 Mbps (Basic Bundled Offer)","12/1 Mbps (Non-Basic Bundled Offer)","25/5 Mbps and 25/10 Mbps","50/20 Mbps and Up to 100/Up to 20 Mbps "]
[null,"FY26 ACC\n1 July 2025 - 30 June 2026 ",{"$f":"ROUND(INDEX('FY26 ACC'!$C$18:$F$18,,MATCH(C14,'FY26 ACC'!$C$17:$F$17,0))*(274/365)+INDEX($C$37:$F$37,,MATCH(C14,$C$36:$F$36,0))*(91/365),2)","v":12.01},{"$f":"ROUND(INDEX('FY26 ACC'!$C$18:$F$18,,MATCH(D14,'FY26 ACC'!$C$17:$F$17,0))*(274/365)+INDEX($C$37:$F$37,,MATCH(D14,$C$36:$F$36,0))*(91/365),2)","v":33.9},{"$f":"ROUND(INDEX('FY26 ACC'!$C$18:$F$18,,MATCH(E14,'FY26 ACC'!$C$17:$F$17,0))*(274/365)+INDEX($C$37:$F$37,,MATCH(E14,$C$36:$F$36,0))*(91/365),2)","v":35.07},{"$f":"ROUND(INDEX('FY26 ACC'!$C$18:$F$18,,MATCH(F14,'FY26 ACC'!$C$17:$F$17,0))*(274/365)+INDEX($C$37:$F$37,,MATCH(F14,$C$36:$F$36,0))*(91/365),2)","v":55.26}]
{"$rows_left_out":65}
{"sheet":"FY25 Average Combined Charges","index":9,"n_rows":388,"n_cols":14,"rows_kept":388,"cut":false,"hidden":false,"merged":[[4,1,4,13],[5,1,11,5],[5,10,5,13],[14,2,14,5],[18,1,18,13],[20,2,20,13],[21,2,21,4],[21,5,21,7],[21,8,21,10],[21,11,21,13]]}
[null,"Cell colour meanings"]
[null,"Input cell"]
[null,"Calculation cell"]
[]
[null,"Calculation of the Average Combined Charges for the period 1 July 2024 to 30 June 2025"]
[null,"Note 1: The Average Daily AVC Overage Charge is calculated for each Bundled TC-4 Offer Group, where the Bundled TC-4 Offer Groups are (i) 12/1 Mbps (Basic Bundled Offer); (ii) 12/1 Mbps (Non-Basic Bundled Offer), 25/5 Mbps and 25/10 Mbps; and (iii) 50/20 Mbps and Up to 100/Up to 20 Mbps.\nNote 2: There are separate offers for each of the 12/1 Mbps (Basic Bundled Offer), 12/1 Mbps (Non-Basic Bundled Offer), 25/5 Mbps, 25/10 Mbps, and 50/20 Mbps speed tiers on each relevant access technology, as well as a separate offer for the Up to 100/Up to 20 Mbps bandwidth profile. The calculations shown in the table below group each of the individual offers across their respective access technologies, since these have the same Bundled Price and Daily Combined Charge, and are within the same Bundled TC-4 Offer Group for which an Average Daily AVC Overage Charge is calculated. For example, the 12/1 Mbps (Basic Bundled Offer) item reflects the 12/1 Mbps (Basic Bundled Offer) on the FTTP, FTTB, FTTN, FTTC, and HFC access technologies."]
[]
[]
[]
[]
[]
[]
[]
[]
[null,null,"Bundled TC-4 Offer"]
{"$rows_left_out":374}
{"sheet":"TC-4 Price Relativity Inputs","index":10,"n_rows":46,"n_cols":5,"rows_kept":46,"cut":false,"hidden":false,"merged":[[4,1,4,4],[5,1,9,4]]}
[null,"Cell colour meanings"]
[null,"Input cell"]
[null,"Calculation cell"]
[]
[null,"TC-4 Prices in FY26-28 Pricing Roadmap"]
[null,"Note 1: The 'FY27' prices in column E below, are the 'Year 2' indicative prices in the FY26-28 Pricing Roadmap published by nbn on 1 May 2025, with the exception of the following WAPC Charge Components, which were later published by nbn in the FY26-28 Pricing Roadmap on 14 September 2025: AVC TC-4 250/100 Mbps (HFC); AVC TC-4 2000/100 Mbps (HFC); AVC TC-4 2000/200 Mbps (Fibre); AVC TC-4 2000/500 Mbps (Fibre).\nNote 2: The Bundled TC‑4 Offers listed below transition to Flat‑Rate Offers from 1 July 2026."]
[]
[]
[]
[]
[]
[null,"t−1 Tariff List Table References","WAPC Charge Component","Access Network","Year 2 Indicative Prices\nin Roadmap t − 1"]
[null,"1.1 Flat-Rate Offers","AVC TC-4 25-100/5-20 Mbps","FTTB, FTTN",60.94]
[null,"1.1 Flat-Rate Offers","AVC TC-4 50-100/20 Mbps","FTTC",60.94]
[null,"1.1 Flat-Rate Offers","AVC TC-4 500/50 Mbps","Fibre, HFC",60.94]
{"$rows_left_out":32}
{"sheet":"FY27 EM Inputs","index":11,"n_rows":302,"n_cols":9,"rows_kept":302,"cut":false,"hidden":false,"merged":[[294,4,294,5],[6,1,8,3],[10,4,10,5],[5,1,5,7],[291,1,293,3]]}
[null,"Cell colour meanings"]
[null,"Input cell"]
[null,"Calculation cell"]
[]
[]
[null,"FY27 Excess Adjustment Factor Inputs"]
[null,"Note 1: nbn notes that quantities are annualised, consistent with clause 2D.2.2(g) of the SAU. For example, the quantities for monthly charges are multiplied by 12 for an annualised quantity. Quantities for charges with other billing periods are adjusted as required to an annualised basis.\nNote 2: The qt − 1.25 volumes shown in the t = FY25 column represent volumes supplied from 1 April 2023 and 31 March 2024, annualised in accordance with clause 2D.2.2(g) of the SAU."]
[]
[]
[]
[null,null,null,null,"Prices",null,null,"Quantities"]
[null,null,null,null,"pt − 1","pt",null,"qt − 1.25"]
[null,"Tariff List Table References","WAPC Charge Component","Access Network","FY24","FY25",null,"t = FY25"]
[null,"1.1\t  Flat-Rate Offers","AVC TC-4 25-100/5-20 Mbps","FTTB and FTTN",55,57.22,null,3236816.21]
[null,"1.1\t  Flat-Rate Offers","AVC TC-4 50-100/20 Mbps","FTTC",55,57.22,null,1882996.34]
{"$rows_left_out":288}
{"sheet":"FY28 EM Inputs","index":12,"n_rows":307,"n_cols":9,"rows_kept":307,"cut":false,"hidden":false,"merged":[[272,4,272,5],[269,1,271,3],[6,1,8,3],[10,4,10,5],[5,1,5,7]]}
[null,"Cell colour meanings"]
[null,"Input cell"]
[null,"Calculation cell"]
[]
[]
[null,"FY28 Excess Adjustment Factor Inputs"]
[null,"Note 1: nbn notes that quantities are annualised, consistent with clause 2D.2.2(g) of the SAU. For example, the quantities for monthly charges are multiplied by 12 for an annualised quantity. Quantities for charges with other billing periods are adjusted as required to an annualised basis.\nNote 2: The qt − 1.25 volumes shown in the t = FY26 column represent volumes supplied from 1 April 2024 and 31 March 2025, annualised in accordance with clause 2D.2.2(g) of the SAU."]
[]
[]
[]
[null,null,null,null,"Prices",null,null,"Quantities"]
[null,null,null,null,"pt − 1","pt",null,"qt − 1.25"]
[null,"Tariff List Table References","WAPC Charge Component","Access Network","FY25","FY26",null,"t = FY26"]
[null,"1.3 Bundled TC-4 Offers","AVC TC-4 12/1 Mbps (Basic Bundled Offer)","Fibre, FTTB, FTTN, FTTC, HFC",{"$f":"INDEX('FY25 Average Combined Charges'!$C$17:$F$17,,MATCH(_xlfn._xlws.FILTER('FY26 FACC'!$B$68:$B$80,('FY26 FACC'!$D$68:$D$80=$C14)*('FY26 FACC'!$E$68:$E$80=$D14)),'FY25 Average Combined Charges'!$C$16:$F$16,0))","v":12.01},{"$f":"INDEX('FY26 FACC'!$C$15:$F$15,,MATCH(_xlfn._xlws.FILTER('FY26 FACC'!$B$68:$B$79,('FY26 FACC'!$D$68:$D$79=$C14)*('FY26 FACC'!$E$68:$E$79=$D14)),'FY26 FACC'!$C$14:$F$14,0))","v":12.01},null,3309484.34]
[null,"1.3 Bundled TC-4 Offers","AVC TC-4 12/1 Mbps","Fibre, FTTB, FTTN, FTTC, HFC, Wireless",{"$f":"INDEX('FY25 Average Combined Charges'!$C$17:$F$17,,MATCH(_xlfn._xlws.FILTER('FY26 FACC'!$B$68:$B$80,('FY26 FACC'!$D$68:$D$80=$C15)*('FY26 FACC'!$E$68:$E$80=$D15)),'FY25 Average Combined Charges'!$C$16:$F$16,0))","v":32.68},{"$f":"INDEX('FY26 FACC'!$C$15:$F$15,,MATCH(_xlfn._xlws.FILTER('FY26 FACC'!$B$68:$B$79,('FY26 FACC'!$D$68:$D$79=$C15)*('FY26 FACC'!$E$68:$E$79=$D15)),'FY26 FACC'!$C$14:$F$14,0))","v":33.9},null,2476659.85]
{"$rows_left_out":292}